Best Testng code snippet using org.testng.FileAssert.fail
Source: FileAssertTest.java
...431 FileStub expected = new FileStub("c:\\temp\\expected.txt");432 expected.exists(true);433 try {434 new FileAssert(file, comparator).hasSameContentAs(expected);435 fail();436 } catch (AssertionError e) {437 assertEquals(e.getMessage(),438 "unable to compare contents of files:<c:\\f.txt> and <c:\\temp\\expected.txt>");439 assertSame(e.getCause(), toThrow);440 }441 }442443 @Test public void shouldFailShowingDescriptionIfIOExceptionThrownWhenComparingFiles() {444 file.exists(true);445 FileContentComparatorStub comparator = new FileContentComparatorStub();446 IOException toThrow = new IOException();447 comparator.exceptionToThrow(toThrow);448 FileStub expected = new FileStub("c:\\temp\\expected.txt");449 expected.exists(true);450 try {451 new FileAssert(file, comparator).as("A Test").hasSameContentAs(expected);452 fail();453 } catch (AssertionError e) {454 assertEquals(e.getMessage(),455 "[A Test] unable to compare contents of files:<c:\\f.txt> and <c:\\temp\\expected.txt>");456 assertSame(e.getCause(), toThrow);457 }458 }459460 @Test public void shouldThrowErrorIfFileToCompareToIsNull() {461 expectIllegalArgumentException("File to compare to should not be null").on(new CodeToTest() {462 public void run() throws Throwable {463 new FileAssert(file).hasSameContentAs(null);464 }465 });466 }
...
Source: BaseTest.java
...7import org.testng.annotations.AfterClass;8import org.testng.annotations.BeforeClass;9import utils.DriverManager;10import java.util.concurrent.TimeUnit;11import static org.testng.FileAssert.fail;12public class BaseTest {13 static WebDriver driver;14 // create ExtentReports and attach reporter(s)15 static ExtentReports extent;16 // creates a toggle for the given test, adds all log events under it17 static ExtentTest test;18 @BeforeClass19 public static void beforeClass() {20 String cwd = System.getProperty("user.dir");21 ExtentSparkReporter htmlReporter = new ExtentSparkReporter(cwd + "\\extent.html");22 // attach reporter23 extent = new ExtentReports();24 extent.attachReporter(htmlReporter);25 // add custom system info26 extent.setSystemInfo("Tester:", "Nir Bar");27 // log results28 try {29 driver = DriverManager.getDriverInstance();30 driver.get(DriverManager.getData("url"));31 driver.manage().timeouts().pageLoadTimeout(10, TimeUnit.SECONDS);32 driver.manage().window().maximize();33 } catch (Exception e) {34 e.printStackTrace();35 fail("Cant connect chromeDriver");36 test.log(Status.FAIL, "Driver Connection Failed! " + e.getMessage());37 }38 }39 @AfterClass40 public static void afterClass() {41 //test.log(Status.INFO, "@After test " + "After test method");42 //driver.quit();43 // build and flush report44 extent.flush();45 }46 /*private static String takeScreenShot(String ImagesPath) {47 TakesScreenshot takesScreenshot = (TakesScreenshot) driver;48 File screenShotFile = takesScreenshot.getScreenshotAs(OutputType.FILE);49 File destinationFile = new File(ImagesPath + ".png");...
Source: FileAssert.java
...23 FileObject[] siblings = null;24 try {25 siblings = file.getChildren();26 } catch (FileSystemException e) {27 fail("Not able to get children for " + file, e);28 }29 sort(children);30 Set<String> names = new TreeSet<>();31 for (FileObject sibling : siblings) {32 names.add(sibling.getName().getBaseName());33 }34 if (names.size() != children.length) {35 fail(36 "Wrong number of children for " + file +37 ". Expected <" + Arrays.toString(children) +38 "> but was <" + names.toString() + ">"39 );40 }41 int i = 0;42 for (String name : names) {43 if (!name.equals(children[i++])) {44 fail(45 "Wrong list of children for " + file +46 ". Expected <" + Arrays.toString(children) +47 "> but was <" + names.toString() + ">"48 );49 }50 }51 }52 private FileAssert() {53 }54}...
Source: JodaTest.java
1package io.swagger.jackson;2import static org.testng.Assert.assertEquals;3import static org.testng.Assert.assertNotNull;4import static org.testng.FileAssert.fail;5import io.swagger.annotations.ApiModelProperty;6import io.swagger.converter.ModelConverter;7import io.swagger.converter.ModelConverterContextImpl;8import io.swagger.models.Model;9import io.swagger.models.properties.Property;10import org.joda.time.DateTime;11import org.testng.annotations.Test;12import java.util.Map;13public class JodaTest extends SwaggerTestBase {14 @Test15 public void testSimple() throws Exception {16 final ModelConverter mr = modelResolver();17 final Model model = mr.resolve(ModelWithJodaDateTime.class, new ModelConverterContextImpl(mr), null);18 assertNotNull(model);19 final Map<String, Property> props = model.getProperties();20 assertEquals(props.size(), 2);21 for (Map.Entry<String, Property> entry : props.entrySet()) {22 final String name = entry.getKey();23 final Property prop = entry.getValue();24 if ("name".equals(name)) {25 assertEquals(prop.getType(), "string");26 } else if ("createdAt".equals(name)) {27 assertEquals(prop.getType(), "string");28 assertEquals(prop.getFormat(), "date-time");29 } else {30 fail(String.format("Unknown property '%s'", name));31 }32 }33 }34 static class ModelWithJodaDateTime {35 @ApiModelProperty(value = "Name!", position = 2)36 public String name;37 @ApiModelProperty(value = "creation timestamp", required = true, position = 1)38 public DateTime createdAt;39 }40}...
Source: TestStringCalculator.java
1import org.testng.annotations.BeforeTest;2import org.testng.annotations.Test;3import static org.testng.Assert.assertEquals;4import static org.testng.FileAssert.fail;5@Test6public class TestStringCalculator {7 private StringCalculator calculator;8 @BeforeTest9 public void init(){10 calculator = new StringCalculator();11 }12 public void emptyStringReturnsZero(){13 assertEquals(calculator.add(""), 0);14 }15 public void singleValueIsReplied(){16 assertEquals(calculator.add("10"), 10);17 }18 public void singleCommaDelimiter(){...
Source: DivLongCalculatorTest.java
...3import org.testng.Assert;4import org.testng.annotations.DataProvider;5import org.testng.annotations.Test;67import static org.testng.FileAssert.fail;89public class DivLongCalculatorTest extends ConfigTestNGTests{10 @Test(dataProvider = "valuesForDivOperations", groups = {"simpleOperations", "div"})11 public void longDivTest(long firstNumber, long secondNumber, long division){12 Assert.assertEquals(calculator.div(firstNumber, secondNumber), division, "Invalid result of div operation");13 }1415 @Test(expectedExceptions = NumberFormatException.class, groups = {"simpleOperations", "div"})16 public void longDivByZeroErrorTest() {17 calculator.div(1L, 0L);18 }1920 @Test(groups = {"simpleOperations", "div"})21 public void longDivByZeroErrorMessageTest() {22 try {23 calculator.div(1L, 0L);24 fail("There is should be an exception");25 }catch (Exception e){26 Assert.assertTrue(e instanceof NumberFormatException);27 Assert.assertEquals(e.getMessage(), "Attempt to divide by zero");28 }2930 }3132 @DataProvider(name = "valuesForDivOperations")33 public Object[][] valuesForDivOperations(){34 return new Object[][]{35 {12345678910L, 25L, 12345678910L/25L},36 {1500L, -25L, -1500L/25L},37 {-155447553L, -25L, -155447553L/-25L}38 };
...
Source: TestDBConnectivity.java
...3import org.testng.annotations.Test;4import cemadoare.testsmodes.TestSuite;5import java.sql.Connection;6import java.sql.DriverManager;7import static org.testng.FileAssert.fail;8@Test9public class TestDBConnectivity {10 private final static Logger LOGGER = Logger.getLogger(TestDBConnectivity.class);11 private static final String URL = "jdbc:h2:~/test";12 private static final String USER = "sa";13 private static final String PASSWORD = "";14 public static final String DB_CONNECTIVITY = "DB_CONNECTIVITY";15 @Test(groups = {DB_CONNECTIVITY, TestSuite.SLOW}, timeOut = 6000)16 public void testConnectivity() {17 try (Connection connection = DriverManager.getConnection(URL, USER, PASSWORD)) {18 Class.forName("org.h2.Driver");19 LOGGER.info("Connected successfully");20 } catch (Exception e) {21 fail("Could not connect to the db");22 }23 }24}...
Source: SystemOverviewHelper.java
1package dk.netarkivet.systemtest;2import static org.testng.Assert.assertTrue;3import static org.testng.FileAssert.fail;4import java.util.List;5import org.openqa.selenium.By;6import org.openqa.selenium.WebElement;7import dk.netarkivet.systemtest.page.PageHelper;8public class SystemOverviewHelper {9 public static List<WebElement> getRowContainingLogString(String logSnippet) {10 int logColumn = 5;11 List<WebElement> rows = PageHelper.getWebDriver().findElements(12 By.xpath("//table[@class='system_state_table']/tbody/tr[position()>1]"));13 for (WebElement rowElement : rows) {14 List<WebElement> rowCells = rowElement.findElements(By.xpath("td"));15 if(rowCells.get(logColumn).getText().contains(logSnippet)) {16 return rowCells;17 }...
fail
Using AI Code Generation
1public void fail(String message) {2 throw new AssertionError(message);3}4public void fail(String message, Throwable realCause) {5 throw new AssertionError(message, realCause);6}7public void fail(String message, Throwable realCause, String... details) {8 throw new AssertionError(message, realCause, details);9}10public void fail(String message, String... details) {11 throw new AssertionError(message, details);12}13public void fail(Throwable realCause) {14 throw new AssertionError(realCause);15}16public void fail(Throwable realCause, String... details) {17 throw new AssertionError(realCause, details);18}19public void fail(String... details) {20 throw new AssertionError(details);21}22public void fail() {23 throw new AssertionError();24}25package com.javacodegeeks.testng.maven;26import org.testng.Assert;27import org.testng.FileAssert;28import org.testng.annotations.Test;29public class FileAssertTest {30 public void testFileAssert() {31 FileAssert fileAssert = new FileAssert("C:\\test.txt");32 fileAssert.fail("Test Failed");33 }34}35org.testng.internal.thread.ThreadTimeoutException: Method com.javacodegeeks.testng.maven.FileAssertTest.testFileAssert() didn't finish within the time-out 6000036 at com.javacodegeeks.testng.maven.FileAssertTest.testFileAssert(FileAssertTest.java:10)37package com.javacodegeeks.testng.maven;38import org.testng.Assert;39import org.testng.FileAssert;40import org.testng.annotations.Test;41public class FileAssertTest {42 public void testFileAssert() {43 FileAssert fileAssert = new FileAssert("C:\\test.txt");44 fileAssert.fail(new Throwable("Test Failed"));45 }46}47org.testng.internal.thread.ThreadTimeoutException: Method com.javacodegeeks.testng.maven.FileAssertTest.testFileAssert() didn't finish within
fail
Using AI Code Generation
1FileAssert fileAssert = new FileAssert("path/to/file");2fileAssert.fail("message");3FileAssert fileAssert = new FileAssert("path/to/file");4fileAssert.fail("message", "expected", "actual");5FileAssert fileAssert = new FileAssert("path/to/file");6fileAssert.fail("message", "expected", "actual", "delta");7FileAssert fileAssert = new FileAssert("path/to/file");8fileAssert.fail("message", "expected", "actual", "delta", "delta_type");9FileAssert fileAssert = new FileAssert("path/to/file");10fileAssert.fail("message", "expected", "actual", "delta", "delta_type", "comparison_type");11FileAssert fileAssert = new FileAssert("path/to/file");12fileAssert.fail("message", "expected", "actual", "delta", "delta_type", "comparison_type", "comparison_direction");13FileAssert fileAssert = new FileAssert("path/to/file");14fileAssert.fail("message", "expected", "actual", "delta", "delta_type", "comparison_type", "comparison_direction", "message_type");15FileAssert fileAssert = new FileAssert("path/to/file");16fileAssert.fail("message", "expected", "actual", "delta", "delta_type", "comparison_type", "comparison_direction", "message_type", "values");17FileAssert fileAssert = new FileAssert("path/to/file");18fileAssert.fail("message", "expected", "actual", "delta", "delta_type", "comparison_type", "comparison_direction", "message_type", "values", "expected_values");19FileAssert fileAssert = new FileAssert("path/to/file");20fileAssert.fail("message", "expected", "actual", "delta", "delta_type", "comparison_type", "comparison_direction", "message_type", "values", "expected_values", "actual_values");21FileAssert fileAssert = new FileAssert("path/to/file");22fileAssert.fail("message", "expected", "actual", "delta", "delta_type", "comparison_type", "comparison_direction", "message_type", "values", "expected_values", "actual_values", "delta_values");23FileAssert fileAssert = new FileAssert("path/to/file");24fileAssert.fail("message", "expected", "actual", "delta", "delta_type", "comparison_type", "comparison_direction", "message_type", "values", "expected_values", "actual_values",
fail
Using AI Code Generation
1import org.testng.FileAssert;2FileAssert fileAssert = new FileAssert(file);3fileAssert.fail("The contents of the file are not equal to the given string", "The contents of the file are equal to the given string");4fileAssert.fail("The contents of the file are not equal to the given string", "The contents of the file are equal to the given string", "The error message to be displayed");5fileAssert.fail("The contents of the file are not equal to the given string", "The contents of the file are equal to the given string", "The error message to be displayed", "The error parameters to be displayed");6fileAssert.fail("The contents of the file are not equal to the given string", "The contents of the file are equal to the given string", "The error message to be displayed", "The error parameters to be displayed", new Throwable("The cause of the failure"));7fileAssert.fail("The contents of the file are not equal to the given string", "The contents of the file are equal to the given string", "The error message to be displayed", "The error parameters to be displayed", new Throwable("The cause of the failure"), 5);
module java.base does not read module java.desktop
Skip one maven test does not work
TestNG test not using TestPropertySource for injecting @Value
@BeforeClass annotations invoking methods twice when using Arquillian on remote server
How to open specific browser using Selenium webdriver
Weird behaviour in TestNG with dependencies - no error raised
Can we get TestNG report showing whether test class has pass or fail
TestNG - How to avoid checkstyle error when number of parameters exceeds 7?
@MockClass is not working
How to pass any UUID in a function in unit testing in mockito?
The IllegalAccessError hints that JMockit has instrumented ProcessBuilder (in java.base) with a reference to an exception in the java.desktop module. I don't know why it choose this exception, that may be something for the JMockit mailing list. However it does explain why --add-reads
fixes the issue.
Check out the latest blogs from LambdaTest on this topic:
This article is a part of our Content Hub. For more in-depth resources, check out our content hub on Jenkins Tutorial.
Every software project involves some kind of ‘processes’ & ‘practices’ for successful execution & deployment of the project. As the size & scale of the project increases, the degree of complications also increases in an exponential manner. The leadership team should make every possible effort to develop, test, and release the software in a manner so that the release is done in an incremental manner thereby having minimal (or no) impact on the software already available with the customer.
Are you comfortable pushing a buggy release to a staging environment?
The obsolete conventional methods of software developments were not taking over the escalated market trends, and those methods lacked solutions for the increased demand of quick software release that introduced the “Continuous Integration (CI) and Continuous Delivery (CD)”. Along with CI/CD, you need to have that kind of technical capability where developers adapt to the shortened delivery cycles and automation processes. Keeping up with the acceleration of change in the testing world, you need to deepen, broaden, and make a strong network with other QA professionals also. Easier said than done, I know! I have often observed the struggle involved in implementing a CI/CD pipeline release cycles, improper resource management, unrealistic ETAs, hesitation involved in task management from a QA manager point of view. Which is why, I intend to talk about the rise of CI/CD pipeline, common challenges, and actionable insights every QA should follow, to cruise swiftly & safely through every release using a CI/CD pipeline.
When anyone refers to automated browser testing, it somehow means that the testing will be performed on the latest browsers like Chrome, Firefox, etc. It would come as a surprise if someone from your team meant that the testing should be done on IE (or Internet Explorer) using Selenium IE Driver or Selenium Internet Explorer Driver.
TestNG is a Java-based open-source framework for test automation that includes various test types, such as unit testing, functional testing, E2E testing, etc. TestNG is in many ways similar to JUnit and NUnit. But in contrast to its competitors, its extensive features make it a lot more reliable framework. One of the major reasons for its popularity is its ability to structure tests and improve the scripts' readability and maintainability. Another reason can be the important characteristics like the convenience of using multiple annotations, reliance, and priority that make this framework popular among developers and testers for test design. You can refer to the TestNG tutorial to learn why you should choose the TestNG framework.
You can push your abilities to do automated testing using TestNG and advance your career by earning a TestNG certification. Check out our TestNG certification.
Watch this complete tutorial to learn how you can leverage the capabilities of the TestNG framework for Selenium automation testing.
Get 100 minutes of automation test minutes FREE!!