Best JSONassert code snippet using org.skyscreamer.jsonassert.JSONCompareTest.succeedsWithNestedJSONObjectsInUnorderedArray
Source: JSONCompareTest.java
...106 JSONCompareResult result = compareJSON("[{\"address\" : {\"street\" : \"Acacia Avenue\"}}]", "[{\"age\" : 23}]", LENIENT);107 assertThat(result, failsWithMessage(equalTo("[0] Could not find match for element {\"address\":{\"street\":\"Acacia Avenue\"}}")));108 }109 @Test110 public void succeedsWithNestedJSONObjectsInUnorderedArray() throws JSONException {111 assertTrue(compareJSON("[{\"address\" : {\"street\" : \"Acacia Avenue\"}}, 5]", "[5, {\"address\" : {\"street\" : \"Acacia Avenue\"}}]", LENIENT).passed());112 }113 @Test114 public void succeedsWithJSONObjectsWithNonUniqueKeyInUnorderedArray() throws JSONException {115 String jsonDocument = "[{\"age\" : 43}, {\"age\" : 43}]";116 assertTrue(compareJSON(jsonDocument, jsonDocument, LENIENT).passed());117 }118 @Test119 public void succeedsWithSomeNestedJSONObjectsInUnorderedArray() throws JSONException {120 String jsonDocument = "[{\"age\" : 43}, {\"age\" : {\"years\" : 43}}]";121 assertTrue(compareJSON(jsonDocument, jsonDocument, LENIENT).passed());122 }123 @Test124 public void reportsUnmatchesIntegerValueInUnorderedArrayContainingJSONObject() throws JSONException {...
succeedsWithNestedJSONObjectsInUnorderedArray
Using AI Code Generation
1import org.skyscreamer.jsonassert.JSONCompare;2import org.skyscreamer.jsonassert.JSONCompareMode;3import org.skyscreamer.jsonassert.comparator.CustomComparator;4import org.skyscreamer.jsonassert.comparator.JSONComparator;5import org.skyscreamer.jsonassert.comparator.JSONCompareUtil;6import java.util.Arrays;7import java.util.List;8import java.util.Map;9public class JSONCompareTest {10 public static void main(String[] args) {11 succeedsWithNestedJSONObjectsInUnorderedArray();12 }13 public static void succeedsWithNestedJSONObjectsInUnorderedArray() {14 String expected = "{\"foo\":[{\"bar\":\"baz\"},{\"bar\":\"baz\"}]}";15 String actual = "{\"foo\":[{\"bar\":\"baz\"},{\"bar\":\"baz\"}]}";16 JSONCompare.assertEquals(expected, actual, JSONCompareMode.LENIENT);17 }18}
succeedsWithNestedJSONObjectsInUnorderedArray
Using AI Code Generation
1import org.skyscreamer.jsonassert.JSONCompare;2import org.skyscreamer.jsonassert.JSONCompareMode;3import org.skyscreamer.jsonassert.JSONParser;4import org.skyscreamer.jsonassert.JSONCompareResult;5import org.skyscreamer.jsonassert.Customization;6import java.io.IOException;7import java.io.StringReader;8import java.io.StringWriter;9import java.io.Writer;10import java.util.Iterator;11import java.util.List;12import java.util.Map;13import java.util.Set;14import org.apache.commons.io.IOUtils;15import org.codehaus.jackson.JsonFactory;16import org.codehaus.jackson.JsonGenerator;17import org.codehaus.jackson.JsonNode;18import org.codehaus.jackson.JsonParser;19import org.codehaus.jackson.JsonToken;20import org.codehaus.jackson.map.ObjectMapper;21import org.codehaus.jackson.node.ArrayNode;22import org.codehaus.jackson.node.ObjectNode;23import org.junit.Test;24import static org.junit.Assert.*;25public class JSONCompareTest {26 public void succeedsWithNestedJSONObjectsInUnorderedArray() throws Exception {27 String expected = "{ \"name\": \"John\", \"age\": 30, \"cars\": [ { \"name\":\"Ford\", \"models\":[ \"Fiesta\", \"Focus\", \"Mustang\" ] }, { \"name\":\"BMW\", \"models\":[ \"320\", \"X3\", \"X5\" ] }, { \"name\":\"Fiat\", \"models\":[ \"500\", \"Panda\" ] } ] }";28 String actual = "{ \"name\": \"John\", \"age\": 30, \"cars\": [ { \"name\":\"BMW\", \"models\":[ \"320\", \"X3\", \"X5\" ] }, { \"name\":\"Fiat\", \"models\":[ \"500\", \"Panda\" ] }, { \"name\":\"Ford\", \"models\":[ \"Fiesta\", \"Focus\", \"Mustang\" ] } ] }";29 JSONCompareResult result = JSONCompare.compareJSON(expected, actual, JSONCompareMode.STRICT);30 assertTrue(result.passed());31 }32}
succeedsWithNestedJSONObjectsInUnorderedArray
Using AI Code Generation
1import org.skyscreamer.jsonassert.JSONCompare;2import org.skyscreamer.jsonassert.JSONCompareMode;3import org.skyscreamer.jsonassert.JSONParser;4import org.skyscreamer.jsonassert.JSONParserException;5import org.skyscreamer.jsonassert.comparator.CustomComparator;6import org.skyscreamer.jsonassert.comparator.JSONComparator;7import org.skyscreamer.jsonassert.comparator.JSONCompareUtil;8import org.skyscreamer.jsonassert.comparator.JSONCompareResult;9import org.skyscreamer.jsonassert.comparator.NumericComparator;10import org.skyscreamer.jsonassert.comparator.DefaultComparator;11import or
succeedsWithNestedJSONObjectsInUnorderedArray
Using AI Code Generation
1[INFO] [ERROR] Failed to execute goal org.apache.maven.plugins:maven-compiler-plugin:3.5.1:testCompile (default-testCompile) on project jsonassert: Compilation failure: Compilation failure: 2[INFO] [ERROR] symbol: method succeedsWithNestedJSONObjectsInUnorderedArray()3[INFO] [ERROR] symbol: method succeedsWithNestedJSONObjectsInUnorderedArray()4[INFO] [ERROR] symbol: method succeedsWithNestedJSONObjectsInUnorderedArray()5[INFO] [ERROR] symbol: method succeedsWithNestedJSONObjectsInUnorderedArray()6[INFO] [ERROR] symbol: method succeedsWithNestedJSONObjectsInUnorderedArray()
succeedsWithNestedJSONObjectsInUnorderedArray
Using AI Code Generation
1public void testSucceedsWithNestedJSONObjectsInUnorderedArray() throws JSONException {2 String actual = "{\"a\":[{\"b\":\"b\",\"c\":\"c\"},{\"c\":\"c\",\"b\":\"b\"}]}";3 String expected = "{\"a\":[{\"c\":\"c\",\"b\":\"b\"},{\"b\":\"b\",\"c\":\"c\"}]}";4 JSONAssert.assertEquals(expected, actual, true);5}6JSONAssert.assertEquals() method7public static void assertEquals(String expected, String actual) throws JSONException8package org.skyscreamer.jsonassert; 9import org.json.JSONException; 10import org.skyscreamer.jsonassert.JSONAssert; 11public class JSONCompareTest { 12 public static void main(String[] args) throws JSONException { 13 String actual = "{\"a\":\"b\"}"; 14 String expected = "{\"a\":\"b\"}"; 15 JSONAssert.assertEquals(expected, actual); 16 } 17}18JSONAssert.assertNotEquals() method19public static void assertNotEquals(String expected, String actual) throws JSONException20package org.skyscreamer.jsonassert; 21import org.json.JSONException; 22import org.skyscreamer.jsonassert.JSONAssert; 23public class JSONCompareTest { 24 public static void main(String[] args) throws JSONException { 25 String actual = "{\"a\":\"b\"}"; 26 String expected = "{\"a\":\"c\"}"; 27 JSONAssert.assertNotEquals(expected, actual); 28 } 29}30Difference between JSON.parse() and JSON.stringify() in JavaScript
succeedsWithNestedJSONObjectsInUnorderedArray
Using AI Code Generation
1public void testSucceedsWithNestedJSONObjectsInUnorderedArray() throws Exception {2 String expected = "{3 {4 },5 {6 }7 }";8 String actual = "{9 {10 },11 {12 }13 }";14 JSONAssert.assertEquals(expected, actual, JSONCompareMode.LENIENT);15}16org.skyscreamer.jsonassert.JSONAssert.assertEquals(expected, actual, JSONCompareMode.LENIENT);17 at org.skyscreamer.jsonassert.JSONCompareTest.succeedsWithNestedJSONObjectsInUnorderedArray(JSONCompareTest.java:75)18 at sun.reflect.NativeMethodAccessorImpl.invoke0(Native Method)19 at sun.reflect.NativeMethodAccessorImpl.invoke(NativeMethodAccessorImpl.java:57)20 at sun.reflect.DelegatingMethodAccessorImpl.invoke(DelegatingMethodAccessorImpl.java:43)21 at java.lang.reflect.Method.invoke(Method.java:606)22 at org.junit.runners.model.FrameworkMethod$1.runReflectiveCall(FrameworkMethod.java:45)23 at org.junit.internal.runners.model.ReflectiveCallable.run(ReflectiveCallable.java:15)24 at org.junit.runners.model.FrameworkMethod.invokeExplosively(FrameworkMethod.java:42)25 at org.junit.internal.runners.statements.InvokeMethod.evaluate(InvokeMethod.java:20)26 at org.junit.runners.ParentRunner.runLeaf(ParentRunner.java:263)27 at org.junit.runners.BlockJUnit4ClassRunner.runChild(BlockJUnit4ClassRunner.java:68)28 at org.junit.runners.BlockJUnit4ClassRunner.runChild(BlockJUnit4ClassRunner.java:47)29 at org.junit.runners.ParentRunner$3.run(ParentRunner.java:231)30 at org.junit.runners.ParentRunner$1.schedule(ParentRunner.java:60)31 at org.junit.runners.ParentRunner.runChildren(ParentRunner.java:229)32 at org.junit.runners.ParentRunner.access$000(ParentRunner.java:50)33 at org.junit.runners.ParentRunner$2.evaluate(ParentRunner.java:222)34 at org.junit.runners.ParentRunner.run(ParentRunner.java:292)35 at org.eclipse.jdt.internal.junit4.runner.JUnit4TestReference.run(JUnit4
Check out the latest blogs from LambdaTest on this topic:
Are members of agile teams different from members of other teams? Both yes and no. Yes, because some of the behaviors we observe in agile teams are more distinct than in non-agile teams. And no, because we are talking about individuals!
One of the essential parts when performing automated UI testing, whether using Selenium or another framework, is identifying the correct web elements the tests will interact with. However, if the web elements are not located correctly, you might get NoSuchElementException in Selenium. This would cause a false negative result because we won’t get to the actual functionality check. Instead, our test will fail simply because it failed to interact with the correct element.
When I started writing tests with Cypress, I was always going to use the user interface to interact and change the application’s state when running tests.
The key to successful test automation is to focus on tasks that maximize the return on investment (ROI), ensuring that you are automating the right tests and automating them in the right way. This is where test automation strategies come into play.
Learn to execute automation testing from scratch with LambdaTest Learning Hub. Right from setting up the prerequisites to run your first automation test, to following best practices and diving deeper into advanced test scenarios. LambdaTest Learning Hubs compile a list of step-by-step guides to help you be proficient with different test automation frameworks i.e. Selenium, Cypress, TestNG etc.
You could also refer to video tutorials over LambdaTest YouTube channel to get step by step demonstration from industry experts.
Get 100 minutes of automation test minutes FREE!!