How to use evaluate method of org.junit.rules.RunRules class

Best junit code snippet using org.junit.rules.RunRules.evaluate

copy

Full Screen

...57 public void run() {58 try {59 RunRules runRules = new RunRules(new Statement() {60 @Override61 public void evaluate() throws Throwable {62 rulesExecutionLatch.countDown();63 wrappedStatementLatch.await();64 }65 }, rules, description);66 runRules.evaluate();67 } catch (Throwable t) {68 if (rulesExecutionLatch.getCount() != 0) {69 /​/​exception on rule70 rulesExecutionLatch.countDown();71 }72 throwable.set(t);73 }74 }75 };76 }77 private TestRule getTestRule(RulesData rulesData, Object obj, RulesBackend.RuleAccessor accessor) throws IllegalAccessException, InvocationTargetException {78 TestRule rule = accessor.getRule(obj);79 if (rulesData.getAnnotation().useAsTestClassInDescription()){80 TestRule finalRule = rule;...

Full Screen

Full Screen
copy

Full Screen

...38 static class KnownBugRule implements TestRule {39 public Statement apply(final Statement base, final Description description) {40 return new Statement() {41 @Override42 public void evaluate() throws Throwable {43 String testclassname = description.getTestClass().getSimpleName();44 String testmethodname = description.getMethodName();45 Ignore ignore = description.getAnnotation(Ignore.class);46 try {47 base.evaluate();48 if (ignore != null && ignore.value().startsWith("KnownBug"))49 log.info("Fixed: "+ignore.value()+" ["+testclassname+'#'+testmethodname+']');50 } catch (AssumptionViolatedException e) {51 /​/​ some other assumption failed52 throw e;53 } catch (AssertionError | Exception e) {54 if (ignore != null && ignore.value().startsWith("KnownBug")) {55 log.info("KnownBug Test Failure: "+ignore.value()+" ["+testclassname+'#'+testmethodname+']',e);56 throw new AssumptionViolatedException("KnownBug Test Failure: "+ignore.value(), e);57 } else {58 throw e;59 }60 }61 }...

Full Screen

Full Screen
copy

Full Screen

...16/​* */​ 17/​* */​ 18/​* */​ 19/​* */​ 20/​* 20 */​ public void evaluate() throws Throwable { this.statement.evaluate(); }21/​* */​ 22/​* */​ 23/​* */​ 24/​* */​ private static Statement applyAll(Statement result, Iterable<TestRule> rules, Description description) {25/​* 25 */​ for (TestRule each : rules) {26/​* 26 */​ result = each.apply(result, description);27/​* */​ }28/​* 28 */​ return result;29/​* */​ }30/​* */​ }31/​* Location: C:\Users\Tarik\OneDrive - fer.hr\FAKS\5. semestar\PPP\Testiranje\Test programi\jChess-1.5\jChess-1.5\jChess-1.5.jar!\org\junit\rules\RunRules.class32 * Java compiler version: 5 (49.0)33 * JD-Core Version: 1.1.234 */​...

Full Screen

Full Screen
copy

Full Screen

...16 @Override17 public Statement apply(final Statement base, final Description description) {18 return new Statement() {19 @Override20 public void evaluate() throws Throwable {21 logger = Logger.getLogger(description.getTestClass().getName() + '.' + description.getDisplayName());22 logger.warning("Your test is showing! Rule name: " + name);23 base.evaluate();24 }25 };26 }27}...

Full Screen

Full Screen

evaluate

Using AI Code Generation

copy

Full Screen

1import org.junit.Rule;2import org.junit.Test;3import org.junit.rules.MethodRule;4import org.junit.rules.TestRule;5import org.junit.runner.Description;6import org.junit.runners.model.FrameworkMethod;7import org.junit.runners.model.Statement;8public class RunRulesTest {9 public TestRule testRule = new TestRule() {10 public Statement apply(Statement base, Description description) {11 return new Statement() {12 public void evaluate() throws Throwable {13 System.out.println("Test Rule");14 base.evaluate();15 }16 };17 }18 };19 public MethodRule methodRule = new MethodRule() {20 public Statement apply(Statement base, FrameworkMethod method, Object target) {21 return new Statement() {22 public void evaluate() throws Throwable {23 System.out.println("Method Rule");24 base.evaluate();25 }26 };27 }28 };29 public void test() {30 System.out.println("Test");31 }32}33RunRules(TestRule[] rules, Description description)34evaluate()35package com.journaldev.junit.rules;36import org.junit.Rule;37import org.junit.Test;38import org.junit.rules.TestRule;39import org.junit.runner.Description;40import org.junit.runners.model.Statement;41public class RunRulesTest {42 public TestRule testRule = new TestRule() {43 public Statement apply(Statement base, Description description) {44 return new Statement() {45 public void evaluate() throws Throwable {46 System.out.println("Test Rule");47 base.evaluate();48 }49 };50 }51 };52 public void test() {53 System.out.println("Test");54 }55}

Full Screen

Full Screen

evaluate

Using AI Code Generation

copy

Full Screen

1import org.junit.rules.RunRules;2import org.junit.rules.TestRule;3import org.junit.runner.Description;4import org.junit.runners.model.Statement;5public class RunRulesExample {6 public static void main(String[] args) {7 RunRules runRules = new RunRules(new TestRule() {8 public Statement apply(Statement statement, Description description) {9 return statement;10 }11 }, null);12 runRules.evaluate();13 }14}15RunRulesExample.java:7: error: constructor RunRules in class RunRules cannot be applied to given types;16 RunRules runRules = new RunRules(new TestRule() {

Full Screen

Full Screen

evaluate

Using AI Code Generation

copy

Full Screen

1import org.junit.rules.RunRules;2import org.junit.rules.RuleChain;3import org.junit.rules.TestRule;4import org.junit.Rule;5import org.junit.rules.TestWatcher;6import org.junit.runner.Description;7import org.junit.runner.RunWith;8import org.junit.runners.JUnit4;9import org.junit.runners.model.Statement;10@RunWith(JUnit4.class)11public class RunRulesTest {12 public RunRules runRules = new RunRules(new TestRule() {13 public Statement apply(Statement base, Description description) {14 return new Statement() {15 public void evaluate() throws Throwable {16 System.out.println("This is the first rule");17 base.evaluate();18 System.out.println("This is the first rule");19 }20 };21 }22 }, RuleChain.emptyRuleChain(), false);23 public TestRule secondRule = new TestWatcher() {24 protected void starting(Description description) {25 super.starting(description);26 System.out.println("This is the second rule");27 }28 protected void finished(Description description) {29 super.finished(description);30 System.out.println("This is the second rule");31 }32 };33 public void test() {34 System.out.println("This is a test");35 }36}

Full Screen

Full Screen

evaluate

Using AI Code Generation

copy

Full Screen

1import org.junit.rules.RunRules;2import org.junit.runner.Description;3import org.junit.runners.model.Statement;4public class RunRulesExample {5 public static void main(String[] args) throws Throwable {6 RunRules runRules = new RunRules(new Statement() {7 public void evaluate() throws Throwable {8 System.out.println("Statement evaluate method");9 }10 }, new MyRule(), Description.EMPTY);11 runRules.evaluate();12 }13}14public class MyRule implements TestRule {15 public Statement apply(Statement statement, Description description) {16 return new Statement() {17 public void evaluate() throws Throwable {18 System.out.println("MyRule evaluate method");19 statement.evaluate();20 }21 };22 }23}

Full Screen

Full Screen

evaluate

Using AI Code Generation

copy

Full Screen

1import org.junit.rules.RunRules;2import org.junit.rules.TestRule;3import org.junit.runner.Description;4import org.junit.runners.model.Statement;5public class RunRulesTest {6 public static void main(String[] args) {7 RunRulesTest runRulesTest = new RunRulesTest();8 runRulesTest.testRunRules();9 }10 public void testRunRules() {11 RunRules runRules = new RunRules(new TestRule() {12 public Statement apply(Statement base, Description description) {13 return base;14 }15 }, null);16 try {17 runRules.evaluate();18 } catch (Throwable e) {19 e.printStackTrace();20 }21 }22}231) testRunRules(org.junit.rules.RunRulesTest)24 at org.junit.rules.RunRules.evaluate(RunRules.java:25)25 at org.junit.runners.ParentRunner.runLeaf(ParentRunner.java:271)26 at org.junit.runners.BlockJUnit4ClassRunner.runChild(BlockJUnit4ClassRunner.java:70)27 at org.junit.runners.BlockJUnit4ClassRunner.runChild(BlockJUnit4ClassRunner.java:50)28 at org.junit.runners.ParentRunner$3.run(ParentRunner.java:238)29 at org.junit.runners.ParentRunner$1.schedule(ParentRunner.java:63)30 at org.junit.runners.ParentRunner.runChildren(ParentRunner.java:236)31 at org.junit.runners.ParentRunner.access$000(ParentRunner.java:53)32 at org.junit.runners.ParentRunner$2.evaluate(ParentRunner.java:229)33 at org.junit.runners.ParentRunner.run(ParentRunner.java:309)34 at org.eclipse.jdt.internal.junit4.runner.JUnit4TestReference.run(JUnit4TestReference.java:50)35 at org.eclipse.jdt.internal.junit.runner.TestExecution.run(TestExecution.java:38)36 at org.eclipse.jdt.internal.junit.runner.RemoteTestRunner.runTests(RemoteTestRunner.java:467)37 at org.eclipse.jdt.internal.junit.runner.RemoteTestRunner.runTests(RemoteTestRunner.java:683)38 at org.eclipse.jdt.internal.junit.runner.RemoteTestRunner.run(RemoteTestRunner.java:390)39 at org.eclipse.jdt.internal.junit.runner.RemoteTestRunner.main(RemoteTestRunner.java:197)402) testRunRules(org.junit.rules.RunRulesTest)

Full Screen

Full Screen

evaluate

Using AI Code Generation

copy

Full Screen

1import org.junit.rules.TestRule;2import org.junit.runner.Description;3import org.junit.runners.model.Statement;4import org.junit.Rule;5import org.junit.Test;6import org.junit.rules.RunRules;7public class RunRulesDemo {8 public TestRule runRules = new RunRules(new TestRule() {9 public Statement apply(Statement base, Description description) {10 return new Statement() {11 public void evaluate() throws Throwable {12 System.out.println("Rule 1");13 base.evaluate();14 }15 };16 }17 }, new TestRule() {18 public Statement apply(Statement base, Description description) {19 return new Statement() {20 public void evaluate() throws Throwable {21 System.out.println("Rule 2");22 base.evaluate();23 }24 };25 }26 }, new TestRule() {27 public Statement apply(Statement base, Description description) {28 return new Statement() {29 public void evaluate() throws Throwable {30 System.out.println("Rule 3");31 base.evaluate();32 }33 };34 }35 });36 public void test() {37 System.out.println("Test");38 }39}

Full Screen

Full Screen

evaluate

Using AI Code Generation

copy

Full Screen

1import org.junit.rules.RunRules;2import org.junit.rules.TestRule;3import org.junit.runner.Description;4import org.junit.runners.model.Statement;5public class RunRulesTest {6 public void test() {7 RunRules runRules = new RunRules(new TestRule() {8 public Statement apply(Statement base, Description description) {9 return new Statement() {10 public void evaluate() throws Throwable {11 System.out.println("evaluating test: " + description.getMethodName());12 base.evaluate();13 }14 };15 }16 }, null);17 runRules.apply(null, Description.createTestDescription(RunRulesTest.class, "test")).evaluate();18 }19}

Full Screen

Full Screen

evaluate

Using AI Code Generation

copy

Full Screen

1import org.junit.rules.TestRule;2import org.junit.runner.Description;3import org.junit.runners.model.Statement;4import org.junit.runner.Result;5import org.junit.runner.JUnitCore;6import org.junit.Rule;7public class RunRules {8 public static void main(String[] args) {9 Result result = JUnitCore.runClasses(RunRules.class);10 System.out.println("Number of tests run: " + result.getRunCount());11 System.out.println("Number of tests failed: " + result.getFailureCount());12 System.out.println("Number of tests ignored: " + result.getIgnoreCount());13 System.out.println("Number of tests succeeded: " + result.wasSuccessful());14 }15 public TestRule rule = new TestRule() {16 public Statement apply(Statement statement, Description description) {17 return new Statement() {18 public void evaluate() throws Throwable {19 Result result = JUnitCore.runClasses(RunRules.class);20 System.out.println("Failure message: " + result.getFailures());21 System.out.println("Run time: " + result.getRunTime());22 System.out.println("Is test ignored: " + result.wasIgnored());23 System.out.println("Is test successful: " + result.wasSuccessful());24 System.out.println("Is test assumed: " + result.wasSuccessful());25 System.out.println("Is test failed: " + result.wasSuccessful());26 System.out.println("Is test skipped: " + result.wasSuccessful());27 statement.evaluate();28 }29 };30 }31 };32 public void test() {33 }34}35 public void testRunRules() {36 RunRules runRules = new RunRules(new TestRule() {37 public Statement apply(Statement base, Description description) {38 return base;39 }40 }, null);41 try {42 runRules.evaluate();43 } catch (Throwable e) {44 e.printStackTrace();45 }46 }47}481) testRunRules(org.junit.rules.RunRulesTest)49 at org.junit.rules.RunRules.evaluate(RunRules.java:25)50 at org.junit.runners.ParentRunner.runLeaf(ParentRunner.java:271)51 at org.junit.runners.BlockJUnit4ClassRunner.runChild(BlockJUnit4ClassRunner.java:70)52 at org.junit.runners.BlockJUnit4ClassRunner.runChild(BlockJUnit4ClassRunner.java:50)53 at org.junit.runners.ParentRunner$3.run(ParentRunner.java:238)54 at org.junit.runners.ParentRunner$1.schedule(ParentRunner.java:63)55 at org.junit.runners.ParentRunner.runChildren(ParentRunner.java:236)56 at org.junit.runners.ParentRunner.access$000(ParentRunner.java:53)57 at org.junit.runners.ParentRunner$2.evaluate(ParentRunner.java:229)58 at org.junit.runners.ParentRunner.run(ParentRunner.java:309)59 at org.eclipse.jdt.internal.junit4.runner.JUnit4TestReference.run(JUnit4TestReference.java:50)60 at org.eclipse.jdt.internal.junit.runner.TestExecution.run(TestExecution.java:38)61 at org.eclipse.jdt.internal.junit.runner.RemoteTestRunner.runTests(RemoteTestRunner.java:467)62 at org.eclipse.jdt.internal.junit.runner.RemoteTestRunner.runTests(RemoteTestRunner.java:683)63 at org.eclipse.jdt.internal.junit.runner.RemoteTestRunner.run(RemoteTestRunner.java:390)64 at org.eclipse.jdt.internal.junit.runner.RemoteTestRunner.main(RemoteTestRunner.java:197)652) testRunRules(org.junit.rules.RunRulesTest)

Full Screen

Full Screen

evaluate

Using AI Code Generation

copy

Full Screen

1import org.junit.rules.TestRule;2import org.junit.runner.Description;3import org.junit.runners.model.Statement;4import org.junit.Rule;5import org.junit.Test;6import org.junit.rules.RunRules;7public class RunRulesDemo {8 public TestRule runRules = new RunRules(new TestRule() {9 public Statement apply(Statement base, Description description) {10 return new Statement() {11 public void evaluate() throws Throwable {12 System.out.println("Rule 1");13 base.evaluate();14 }15 };16 }17 }, new TestRule() {18 public Statement apply(Statement base, Description description) {19 return new Statement() {20 public void evaluate() throws Throwable {21 System.out.println("Rule 2");22 base.evaluate();23 }24 };25 }26 }, new TestRule() {27 public Statement apply(Statement base, Description description) {28 return new Statement() {29 public void evaluate() throws Throwable {30 System.out.println("Rule 3");31 base.evaluate();32 }33 };34 }35 });36 public void test() {37 System.out.println("Test");38 }39}

Full Screen

Full Screen

evaluate

Using AI Code Generation

copy

Full Screen

1import org.junit.rules.TestRule;2import org.junit.runner.Description;3import org.junit.runners.model.Statement;4import org.junit.runner.Result;5import org.junit.runner.JUnitCore;6import org.junit.Rule;7public class RunRules {8 public static void main(String[] args) {9 Result result = JUnitCore.runClasses(RunRules.class);10 System.out.println("Number of tests run: " + result.getRunCount());11 System.out.println("Number of tests failed: " + result.getFailureCount());12 System.out.println("Number of tests ignored: " + result.getIgnoreCount());13 System.out.println("Number of tests succeeded: " + result.wasSuccessful());14 }15 public TestRule rule = new TestRule() {16 public Statement apply(Statement statement, Description description) {17 return new Statement() {18 public void evaluate() throws Throwable {19 Result result = JUnitCore.runClasses(RunRules.class);20 System.out.println("Failure message: " + result.getFailures());21 System.out.println("Run time: " + result.getRunTime());22 System.out.println("Is test ignored: " + result.wasIgnored());23 System.out.println("Is test successful: " + result.wasSuccessful());24 System.out.println("Is test assumed: " + result.wasSuccessful());25 System.out.println("Is test failed: " + result.wasSuccessful());26 System.out.println("Is test skipped: " + result.wasSuccessful());27 statement.evaluate();28 }29 };30 }31 };32 public void test() {33 }34}

Full Screen

Full Screen

evaluate

Using AI Code Generation

copy

Full Screen

1import org.junit.rules.RunRules;2import org.junit.rules.RuleChain;3import org.junit.rules.TestRule;4import org.junit.Rule;5import org.junit.rules.TestWatcher;6import org.junit.runner.Description;7import org.junit.runner.RunWith;8import org.junit.runners.JUnit4;9import org.junit.runners.model.Statement;10@RunWith(JUnit4.class)11public class RunRulesTest {12 public RunRules runRules = new RunRules(new TestRule() {13 public Statement apply(Statement base, Description description) {14 return new Statement() {15 public void evaluate() throws Throwable {16 System.out.println("This is the first rule");17 base.evaluate();18 System.out.println("This is the first rule");19 }20 };21 }22 }, RuleChain.emptyRuleChain(), false);23 public TestRule secondRule = new TestWatcher() {24 protected void starting(Description description) {25 super.starting(description);26 System.out.println("This is the second rule");27 }28 protected void finished(Description description) {29 super.finished(description);30 System.out.println("This is the second rule");31 }32 };33 public void test() {34 System.out.println("This is a test");35 }36}

Full Screen

Full Screen

evaluate

Using AI Code Generation

copy

Full Screen

1import org.junit.rules.RunRules;2import org.junit.rules.TestRule;3import org.junit.runner.Description;4import org.junit.runners.model.Statement;5public class RunRulesTest {6 public static void main(String[] args) {7 RunRulesTest runRulesTest = new RunRulesTest();8 runRulesTest.testRunRules();9 }10 public void testRunRules() {11 RunRules runRules = new RunRules(new TestRule() {12 public Statement apply(Statement base, Description description) {13 return base;14 }15 }, null);16 try {17 runRules.evaluate();18 } catch (Throwable e) {19 e.printStackTrace();20 }21 }22}231) testRunRules(org.junit.rules.RunRulesTest)24 at org.junit.rules.RunRules.evaluate(RunRules.java:25)25 at org.junit.runners.ParentRunner.runLeaf(ParentRunner.java:271)26 at org.junit.runners.BlockJUnit4ClassRunner.runChild(BlockJUnit4ClassRunner.java:70)27 at org.junit.runners.BlockJUnit4ClassRunner.runChild(BlockJUnit4ClassRunner.java:50)28 at org.junit.runners.ParentRunner$3.run(ParentRunner.java:238)29 at org.junit.runners.ParentRunner$1.schedule(ParentRunner.java:63)30 at org.junit.runners.ParentRunner.runChildren(ParentRunner.java:236)31 at org.junit.runners.ParentRunner.access$000(ParentRunner.java:53)32 at org.junit.runners.ParentRunner$2.evaluate(ParentRunner.java:229)33 at org.junit.runners.ParentRunner.run(ParentRunner.java:309)34 at org.eclipse.jdt.internal.junit4.runner.JUnit4TestReference.run(JUnit4TestReference.java:50)35 at org.eclipse.jdt.internal.junit.runner.TestExecution.run(TestExecution.java:38)36 at org.eclipse.jdt.internal.junit.runner.RemoteTestRunner.runTests(RemoteTestRunner.java:467)37 at org.eclipse.jdt.internal.junit.runner.RemoteTestRunner.runTests(RemoteTestRunner.java:683)38 at org.eclipse.jdt.internal.junit.runner.RemoteTestRunner.run(RemoteTestRunner.java:390)39 at org.eclipse.jdt.internal.junit.runner.RemoteTestRunner.main(RemoteTestRunner.java:197)402) testRunRules(org.junit.rules.RunRulesTest)

Full Screen

Full Screen

StackOverFlow community discussions

Questions
Discussion

powermock mocking constructor via whennew() does not work with anonymous class

How do you assert that a certain exception is thrown in JUnit tests?

How to assertThat String is not empty

&#39;No JUnit tests found&#39; in Eclipse

java.util.MissingResourceException: Can&#39;t find bundle for base name javax.servlet.LocalStrings, locale es_ES

Naming convention JUnit suffix or prefix Test

Is org.junit.Assert.assertThat better than org.hamcrest.MatcherAssert.assertThat?

Debugging Spring configuration

How to use Mockito with JUnit5

Populating Spring @Value during Unit Test

You need to have prepared the class calling the constructor, not the class on which the constructor is called, the following should fix you up:

@PrepareForTest(DummyTarget.class)

For more information check this page.

https://stackoverflow.com/questions/13481702/powermock-mocking-constructor-via-whennew-does-not-work-with-anonymous-class

Blogs

Check out the latest blogs from LambdaTest on this topic:

TestNG Annotations Tutorial With Examples For Selenium Automation

This article is a part of our Content Hub. For more in-depth resources, check out our content hub on A Detailed TestNG Tutorial.

10 Of The Best PHP Testing Frameworks For 2021

A framework is a collection or set of tools and processes that work together to support testing and developmental activities. It contains various utility libraries, reusable modules, test data setup, and other dependencies. Be it web development or testing, there are multiple frameworks that can enhance your team’s efficiency and productivity. Web testing, in particular, has a plethora of frameworks, and selecting a framework that suits your needs depends on your language of choice.

Page Factory in Selenium For Web Automation Testing

Automation testing has become an absolute necessity in an agile and fast-paced business environment with an immense focus on accelerated time to market. However, as far as automation is concerned, Selenium automation testing still reaps the maximum benefits in terms of test coverage and browser coverage.

How To Generate Test Report In NUnit?

This article is a part of our Content Hub. For more in-depth resources, check out our content hub on Selenium NUnit Tutorial.

Introducing The All-New LambdaTest Chrome Extension!

Hey Testers! Hope you are staying safe and healthy. In these turbulent times, it is evident that organizations need robust and scalable functional capabilities to keep their businesses thriving even when confronted with imminent workplace challenges. We at LambdaTest believe that repetitive aspects of testing should be eliminated using smart solutions.

JUnit Tutorial:

LambdaTest also has a detailed JUnit tutorial explaining its features, importance, advanced use cases, best practices, and more to help you get started with running your automation testing scripts.

JUnit Tutorial Chapters:

Here are the detailed JUnit testing chapters to help you get started:

  • Importance of Unit testing - Learn why Unit testing is essential during the development phase to identify bugs and errors.
  • Top Java Unit testing frameworks - Here are the upcoming JUnit automation testing frameworks that you can use in 2023 to boost your unit testing.
  • What is the JUnit framework
  • Why is JUnit testing important - Learn the importance and numerous benefits of using the JUnit testing framework.
  • Features of JUnit - Learn about the numerous features of JUnit and why developers prefer it.
  • JUnit 5 vs. JUnit 4: Differences - Here is a complete comparison between JUnit 5 and JUnit 4 testing frameworks.
  • Setting up the JUnit environment - Learn how to set up your JUnit testing environment.
  • Getting started with JUnit testing - After successfully setting up your JUnit environment, this chapter will help you get started with JUnit testing in no time.
  • Parallel testing with JUnit - Parallel Testing can be used to reduce test execution time and improve test efficiency. Learn how to perform parallel testing with JUnit.
  • Annotations in JUnit - When writing automation scripts with JUnit, we can use JUnit annotations to specify the type of methods in our test code. This helps us identify those methods when we run JUnit tests using Selenium WebDriver. Learn in detail what annotations are in JUnit.
  • Assertions in JUnit - Assertions are used to validate or test that the result of an action/functionality is the same as expected. Learn in detail what assertions are and how to use them while performing JUnit testing.
  • Parameterization in JUnit - Parameterized Test enables you to run the same automated test scripts with different variables. By collecting data on each method's test parameters, you can minimize time spent on writing tests. Learn how to use parameterization in JUnit.
  • Nested Tests In JUnit 5 - A nested class is a non-static class contained within another class in a hierarchical structure. It can share the state and setup of the outer class. Learn about nested annotations in JUnit 5 with examples.
  • Best practices for JUnit testing - Learn about the best practices, such as always testing key methods and classes, integrating JUnit tests with your build, and more to get the best possible results.
  • Advanced Use Cases for JUnit testing - Take a deep dive into the advanced use cases, such as how to run JUnit tests in Jupiter, how to use JUnit 5 Mockito for Unit testing, and more for JUnit testing.

JUnit Certification:

You can also check out our JUnit certification if you wish to take your career in Selenium automation testing with JUnit to the next level.

Run junit automation tests on LambdaTest cloud grid

Perform automation testing on 3000+ real desktop and mobile devices online.

Most used method in RunRules

Try LambdaTest Now !!

Get 100 minutes of automation test minutes FREE!!

Next-Gen App & Browser Testing Cloud

Was this article helpful?

Helpful

NotHelpful