Best Assertj code snippet using org.assertj.core.navigation.GenericNavigableAssert_Test.buildNavigableAssert
Source: GenericNavigableAssert_Test.java
...32 @Before33 public void init() {34 vehicleFactory = new VehicleFactory();35 expectedVehicles = (T) vehicleFactory.getVehicles();36 vehiclesAssert = buildNavigableAssert();37 vehiclesAssert.as("VehicleFactory.vehicles");38 }39 protected abstract ASSERT buildNavigableAssert();40 @Test41 public void should_allow_to_assert_navigated_elements() {42 vehiclesAssert.first()43 .hasName(getVehicle(0).getName())44 .isEqualTo(getVehicle(0));45 vehiclesAssert.last().isEqualTo(getVehicle(2));46 vehiclesAssert.element(2).isEqualTo(getVehicle(2));47 }48 49 private Vehicle getVehicle(int index) {50 Iterator<Vehicle> actualIterator = expectedVehicles.iterator();51 for (int i = 0; i < index; i++) {52 actualIterator.next();53 }...
buildNavigableAssert
Using AI Code Generation
1[ERROR] Failed to execute goal org.apache.maven.plugins:maven-compiler-plugin:3.8.0:testCompile (default-testCompile) on project assertj-core: Compilation failure: Compilation failure: 2[ERROR] symbol: method buildNavigableAssert(java.lang.Object,java.lang.Class<org.assertj.core.navigation.GenericNavigableAssert_Test>)3[ERROR] symbol: method buildNavigableAssert(java.lang.Object,java.lang.Class<org.assertj.core.navigation.GenericNavigableAssert_Test>)4[ERROR] Failed to execute goal org.apache.maven.plugins:maven-compiler-plugin:3.8.0:testCompile (default-testCompile) on project assertj-core: Compilation failure: Compilation failure: 5[ERROR] symbol: method buildNavigableAssert(java.lang.Object,java.lang.Class<org.assertj.core.navigation.GenericNavigableAssert_Test>)6[ERROR] symbol: method buildNavigableAssert(java.lang.Object,java.lang.Class<org.assertj.core.navigation.GenericNavigableAssert_Test>)7[ERROR] Failed to execute goal org.apache.maven.plugins:maven-compiler-plugin:3.8.0:testCompile (default-testCompile) on project assertj-core:
buildNavigableAssert
Using AI Code Generation
1package org.assertj.core.navigation;2import org.assertj.core.api.AbstractAssert;3public class GenericNavigableAssert_Test {4 public static <SELF extends AbstractAssert<SELF, ACTUAL>, ACTUAL> GenericNavigableAssert_Test buildNavigableAssert(5 ACTUAL actual, Class<?> selfType) {6 return new GenericNavigableAssert_Test(actual, selfType);7 }8 private final Object actual;9 private final Class<?> selfType;10 protected GenericNavigableAssert_Test(Object actual, Class<?> selfType) {11 this.actual = actual;12 this.selfType = selfType;13 }14 public GenericNavigableAssert_Test isEqualTo(Object expected) {15 return this;16 }17 public GenericNavigableAssert_Test isNotEqualTo(Object expected) {18 return this;19 }20 public GenericNavigableAssert_Test isSameAs(Object expected) {21 return this;22 }23 public GenericNavigableAssert_Test isNotSameAs(Object expected) {24 return this;25 }26 public GenericNavigableAssert_Test isInstanceOf(Class<?> type) {27 return this;28 }29 public GenericNavigableAssert_Test isNotInstanceOf(Class<?> type) {30 return this;31 }32 public GenericNavigableAssert_Test isNull() {33 return this;34 }35 public GenericNavigableAssert_Test isNotNull() {36 return this;37 }38 public GenericNavigableAssert_Test isIn(Object... values) {39 return this;40 }41 public GenericNavigableAssert_Test isNotIn(Object... values) {42 return this;43 }44 public GenericNavigableAssert_Test isBetween(Object start, Object end) {45 return this;46 }47 public GenericNavigableAssert_Test isNotBetween(Object start, Object end) {48 return this;49 }50 public GenericNavigableAssert_Test isCloseTo(Number other, Number offset) {
Check out the latest blogs from LambdaTest on this topic:
Hey everyone! We hope you had a great Hacktober. At LambdaTest, we thrive to bring you the best with each update. Our engineering and tech teams work at lightning speed to deliver you a seamless testing experience.
Selenium, a project hosted by the Apache Software Foundation, is an umbrella open-source project comprising a variety of tools and libraries for test automation. Selenium automation framework enables QA engineers to perform automated web application testing using popular programming languages like Python, Java, JavaScript, C#, Ruby, and PHP.
Dries Buytaert, a graduate student at the University of Antwerp, came up with the idea of developing something similar to a chat room. Moreover, he modified the conventional chat rooms into a website where his friends could post their queries and reply through comments. However, for this project, he thought of creating a temporary archive of posts.
In today’s fast-paced world, the primary goal of every business is to release their application or websites to the end users as early as possible. As a result, businesses constantly search for ways to test, measure, and improve their products. With the increase in competition, faster time to market (TTM) has become vital for any business to survive in today’s market. However, one of the possible challenges many business teams face is the release cycle time, which usually gets extended for several reasons.
Learn to execute automation testing from scratch with LambdaTest Learning Hub. Right from setting up the prerequisites to run your first automation test, to following best practices and diving deeper into advanced test scenarios. LambdaTest Learning Hubs compile a list of step-by-step guides to help you be proficient with different test automation frameworks i.e. Selenium, Cypress, TestNG etc.
You could also refer to video tutorials over LambdaTest YouTube channel to get step by step demonstration from industry experts.
Get 100 minutes of automation test minutes FREE!!